{"text_format":"1","workbook":"xlsx","n_sheets":2,"sheets":["Fee look up","Val fees"],"not_rendered":{"charts":0,"images":2,"macros":1,"external_links":0,"defined_names":1,"comments":0,"pivot_tables":0},"unopened":[],"bounds":{"document_bytes":16777216,"sheet_cells":100000,"rows_first":2000,"rows_last":500,"rows_between":2000,"halvings":0,"cell_chars":16384,"cell_head_chars":4096},"cells_cut":0,"cells_raw":0,"read":"whole","date_system":"1900"}

{"sheet":"Fee look up","index":0,"n_rows":51,"n_cols":18,"rows_kept":51,"cut":false,"hidden":false,"merged":[[2,1,2,2],[12,1,12,2],[3,1,3,2],[15,1,15,2],[7,4,7,7],[4,4,4,7],[5,4,5,7],[6,4,6,7],[10,4,10,7],[11,4,11,7],[14,4,14,7]]}
[]
[]
[]
[null,"Valuation Fee (indicative only)"]
[null,"Security postcode",null,null,{"$f":"IF(C5=\"\",\"<== Enter postcode of property to be valued\",\"\")","v":"<== Enter postcode of property to be valued"}]
[null,"Location (as defined by ValEx / Valuer fee schedule)",{"$f":"IF(C5=\"\",\"\",G39)","v":""},null,{"$f":"IF(C6=\"Postcode not found\",\"<== Please check Postcode entered\",\"\")","v":""}]
[null,"Value - Owner estimate/Purchase price "]
[null,"Is land area equal to or greater than 2.2ha?","No",null,{"$f":"IF(C8=\"YES\",\"Any properties with land area equal to or greater than 2.2ha will incur an additional rural residential fee when Valuation is completed\",\"\")","v":""}]
[null,"Construction?","No"]
[null,"Valuation fee",{"$f":"IF(C7>5000000,\"Quote\",IF(AND(C7>0,C7<500001),H$39,(IF(AND(C7>500000,C7<1000001),$I$39,IF(AND(C7>1000000,C7<2000001),$J$39,IF(AND(C7>2000000,C7<3000001),$K$39,IF(AND(C7>3000000,C7<4000001),$L$39,IF(AND(C7>4000000,C49<5000001),$M$39,\"\"))))))))","v":""}]
[null,"Rural Residential Fee (if applicable)",{"$f":"IF(C5=\"\",\"\",IF(C10=\"Quote\",\"Quote\",IF(C8=\"Yes\",O39,0)))","v":""},null,{"$f":"IF(OR(C11=0,C11=\"\"),\"\",\"Note - Rural residential fee is not added until Valuer completes the report, so may not appear in Job Cost initially\")","v":""}]
[null,"Total cost of Valuation payable by Borrower",{"$f":"IF(C10=\"\",\"\",IF(C10=\"Quote\",\"Quote\",SUM(C10:C11)))","v":""},null,{"$f":"IF(OR(C12=0,C12=\"\"),\"\",IF(C12=\"Quote\",\"Postcode is a quote only area - refer to Sales Support for quotes from ValEx\",\"Valuation fee that will appear in Job Cost at settlement\"))","v":""}]
[null,"Progress inspections, if applicable"]
[null,"Progress inspection",{"$f":"IF(AND(C9=\"Yes\",OR(C12=\"Quote\",C7>1000000)),\"Quote\",IF(C9=\"Yes\",N39,\"Not applicable\"))","v":"Not applicable"},null,{"$f":"IF(C12=\"Quote\",\"Postcode is a quote only area - refer to Sales Support for quotes from ValEx\",IF(C14=\"Not applicable\",\"\",\"per progress inspection\"))","v":""}]
[null,"Total progress inspections (5 inspection):",{"$f":"IF(OR(C12=\"Quote\",C7>1000000),\"Quote\",IF(C9=\"Yes\",C14*5,\"Not applicable\"))","v":"Not applicable"},null,{"$f":"IF(C12=\"Quote\",\"Postcode is a quote only area - refer to Sales Support for quotes from ValEx\",IF(C15=\"Not applicable\",\"\",\"Total shown is based on standard progress schedule requiring 5 progress claims. Fee will appear in Job Cost, payable by Borrower at settlement.\"))","v":""}]
[null,"Note - all fees shown are payable by Borrower, and include 25% of GST"]
[]
[]
[]
[]
[]
[]
[]
[]
[]
[]
[]
[]
[]
[]
[]
[]
[]
[]
[null,null,null,null,null,"From Fee look up",null,null,null,null,null,null,null,null,"Set Fees",null,null,"No"]
[null,null,null,null,null,"Postcode","Location (ValEx)","0 - $500K","$500k - $1 Mil","$1 Mil - $2 Mil","$2 Mil - $3 Mil","$3 Mil - $4 Mil","$4 Mil - $5 Mil","progress inspection","Rural res","Management fee",null,"Yes"]
[null,null,null,null,"Lookup value (inc GST 10%) =>",{"$f":"C5","v":0},{"$f":"IFERROR(VLOOKUP($C$5,'Val fees'!$A$2:$I$2606,9,FALSE),\"Postcode not found\")","v":"Postcode not found"},{"$f":"IF(G37=\"Postcode not found\",0,VLOOKUP($C$5,'Val fees'!$A$2:$H$2606,2))","v":0},{"$f":"IF(G37=\"Postcode not found\",0,VLOOKUP($C$5,'Val fees'!$A$2:$H$2606,3))","v":0},{"$f":"IF(G37=\"Postcode not found\",0,VLOOKUP($C$5,'Val fees'!$A$2:$H$2606,4))","v":0},{"$f":"IF(G37=\"Postcode not found\",0,VLOOKUP($C$5,'Val fees'!$A$2:$H$2606,5))","v":0},{"$f":"IF(G37=\"Postcode not found\",0,VLOOKUP($C$5,'Val fees'!$A$2:$H$2606,6))","v":0},{"$f":"IF(G37=\"Postcode not found\",0,VLOOKUP($C$5,'Val fees'!$A$2:$H$2606,7))","v":0},{"$f":"IF(G37=\"Postcode not found\",0,VLOOKUP($C$5,'Val fees'!$A$2:$H$2606,8))","v":0},110,15]
[]
[null,null,null,null,"Payable by borrower (inc Management fee & RITC)=> ",{"$f":"C5","v":0},{"$f":"IFERROR(VLOOKUP($C$5,'Val fees'!$A$2:$I$2606,9,FALSE),\"Postcode not found\")","v":"Postcode not found"},{"$f":"IF(AND($G$39=\"Metro\",H45=220),H45,H51)","v":0},0,0,0,0,0,{"$f":"N51","v":0},{"$f":"IF($G$37=\"Postcode not found\",0,SUM(O37-O37/11)+SUM(O37/11*25%))","v":0}]
[]
[]
[]
[null,null,null,null,null,null,"Base val fee",{"$f":"IF(H37=\"Quote\",\"Quote\",SUM(H37-H37/11))","v":0},0,0,0,0,0,0,{"$f":"IF(G37=\"Postcode not found\",0,SUM(O37-O37/11))","v":0}]
[null,null,null,null,null,null,"GST",{"$f":"IF(H37=\"Quote\",\"Quote\",SUM(H37/11))","v":0},0,0,0,0,0,0,{"$f":"IF(G37=\"Postcode not found\",0,SUM(O37/11))","v":0}]
[null,null,null,null,null,null,"Total inc GST",{"$f":"IF(H37=\"Quote\",\"Quote\",SUM(H43:H44))","v":0},0,0,0,0,0,0,{"$f":"SUM(O43:O44)","v":0}]
[]
[null,null,null,null,null,null,"Base val fee",{"$f":"H43","v":0},{"$f":"I43","v":0},0,0,0,0,0]
[null,null,null,null,null,null,"Val fee RITC",{"$f":"IF(H37=\"Quote\",\"Quote\",SUM(H47*2.5%))","v":0},0,0,0,0,0,0]
[null,null,null,null,null,null,"Base Management fee",{"$f":"IF($G$37=\"Postcode not found\",0,$P$37)","v":0},0,0,0,0,0,"Not charged for Con val fee"]
[null,null,null,null,null,null,"Management fee RITC",{"$f":"IF($G$37=\"Postcode not found\",0,SUM($P$37*2.5%))","v":0},0,0,0,0,0,"Not charged for Con val fee"]
[null,null,null,null,null,null,"Val fee by bwr",{"$f":"IF(H37=\"Quote\",\"Quote\",SUM(H47:H50))","v":0},{"$f":"IF(I37=\"Quote\",\"Quote\",SUM(I47:I50))","v":0},{"$f":"IF(J37=\"Quote\",\"Quote\",SUM(J47:J50))","v":0},0,0,0,0]

{"sheet":"Val fees","index":1,"n_rows":2606,"n_cols":10,"rows_kept":2606,"cut":false,"hidden":true,"merged":[]}
["Postcode","0 - $500K","$500k - $1 Mil","$1 Mil - $2 Mil","$2 Mil - $3 Mil","$3 Mil - $4 Mil","$4 Mil - $5 Mil","progress inspection","Category","***Fees here exclude the Management fee, but do include 10% GST on the val fee"]
[800,220,220,440,825,1650,2200,99,"Metro"]
[810,220,220,440,825,1650,2200,99,"Metro"]
[812,220,220,440,825,1650,2200,99,"Metro"]
[820,220,220,440,825,1650,2200,99,"Metro"]
[822,385,385,385,"Quote","Quote","Quote",206,"Regional"]
[828,231,423.5,550,"Quote","Quote","Quote",110,"Regional"]
[829,"Quote","Quote","Quote","Quote","Quote","Quote","Quote","Regional"]
[830,231,275,550,"Quote","Quote","Quote",110,"Regional"]
[832,231,423.5,550,"Quote","Quote","Quote",110,"Regional"]
[835,286,330,330,"Quote","Quote","Quote",206,"Regional"]
[836,550,550,550,"Quote","Quote","Quote",470,"Regional"]
[837,286,330,330,"Quote","Quote","Quote",206,"Regional"]
[838,286,330,330,"Quote","Quote","Quote",206,"Regional"]
[840,495,495,495,"Quote","Quote","Quote",415,"Regional"]
[841,385,385,385,"Quote","Quote","Quote",305,"Regional"]
[845,495,495,495,"Quote","Quote","Quote",415,"Regional"]
[846,495,495,495,"Quote","Quote","Quote",415,"Regional"]
[847,495,495,495,"Quote","Quote","Quote",415,"Regional"]
[850,495,495,495,"Quote","Quote","Quote",415,"Regional"]
[852,495,495,495,"Quote","Quote","Quote",415,"Regional"]
[853,495,495,495,"Quote","Quote","Quote",415,"Regional"]
[854,495,495,495,"Quote","Quote","Quote",415,"Regional"]
[860,495,495,495,"Quote","Quote","Quote",415,"Regional"]
[862,495,495,495,"Quote","Quote","Quote",415,"Regional"]
[870,242,330,330,"Quote","Quote","Quote",165,"Regional"]
[872,242,330,330,"Quote","Quote","Quote",165,"Regional"]
[880,1300,1300,"Quote","Quote","Quote","Quote",1220,"Regional"]
[885,1300,1300,"Quote","Quote","Quote","Quote",1220,"Regional"]
[886,1300,1300,"Quote","Quote","Quote","Quote",1220,"Regional"]
[2000,220,220,440,825,1650,2200,99,"Metro"]
[2006,220,220,440,825,1650,2200,99,"Metro"]
[2007,220,220,440,825,1650,2200,99,"Metro"]
[2008,220,220,440,825,1650,2200,99,"Metro"]
[2009,220,220,440,825,1650,2200,99,"Metro"]
[2010,220,220,440,825,1650,2200,99,"Metro"]
[2011,220,220,440,825,1650,2200,99,"Metro"]
[2015,220,220,440,825,1650,2200,99,"Metro"]
[2016,220,220,440,825,1650,2200,99,"Metro"]
[2017,220,220,440,825,1650,2200,99,"Metro"]
[2018,220,220,440,825,1650,2200,99,"Metro"]
[2019,220,220,440,825,1650,2200,99,"Metro"]
[2020,220,220,440,825,1650,2200,99,"Metro"]
[2021,220,220,440,825,1650,2200,99,"Metro"]
[2022,220,220,440,825,1650,2200,99,"Metro"]
[2023,220,220,440,825,1650,2200,99,"Metro"]
[2024,220,220,440,825,1650,2200,99,"Metro"]
[2025,220,220,440,825,1650,2200,99,"Metro"]
[2026,220,220,440,825,1650,2200,99,"Metro"]
[2027,220,220,440,825,1650,2200,99,"Metro"]
[2028,220,220,440,825,1650,2200,99,"Metro"]
[2029,220,220,440,825,1650,2200,99,"Metro"]
[2030,220,220,440,825,1650,2200,99,"Metro"]
[2031,220,220,440,825,1650,2200,99,"Metro"]
[2032,220,220,440,825,1650,2200,99,"Metro"]
[2033,220,220,440,825,1650,2200,99,"Metro"]
[2034,220,220,440,825,1650,2200,99,"Metro"]
[2035,220,220,440,825,1650,2200,99,"Metro"]
[2036,220,220,440,825,1650,2200,99,"Metro"]
[2037,220,220,440,825,1650,2200,99,"Metro"]
[2038,220,220,440,825,1650,2200,99,"Metro"]
[2039,220,220,440,825,1650,2200,99,"Metro"]
[2040,220,220,440,825,1650,2200,99,"Metro"]
[2041,220,220,440,825,1650,2200,99,"Metro"]
[2042,220,220,440,825,1650,2200,99,"Metro"]
[2043,220,220,440,825,1650,2200,99,"Metro"]
[2044,220,220,440,825,1650,2200,99,"Metro"]
[2045,220,220,440,825,1650,2200,99,"Metro"]
[2046,220,220,440,825,1650,2200,99,"Metro"]
[2047,220,220,440,825,1650,2200,99,"Metro"]
[2048,220,220,440,825,1650,2200,99,"Metro"]
[2049,220,220,440,825,1650,2200,99,"Metro"]
[2050,220,220,440,825,1650,2200,99,"Metro"]
[2052,220,220,440,825,1650,2200,99,"Metro"]
[2060,220,220,440,825,1650,2200,99,"Metro"]
[2061,220,220,440,825,1650,2200,99,"Metro"]
[2062,220,220,440,825,1650,2200,99,"Metro"]
[2063,220,220,440,825,1650,2200,99,"Metro"]
[2064,220,220,440,825,1650,2200,99,"Metro"]
[2065,220,220,440,825,1650,2200,99,"Metro"]
[2066,220,220,440,825,1650,2200,99,"Metro"]
[2067,220,220,440,825,1650,2200,99,"Metro"]
[2068,220,220,440,825,1650,2200,99,"Metro"]
[2069,220,220,440,825,1650,2200,99,"Metro"]
[2070,220,220,440,825,1650,2200,99,"Metro"]
[2071,220,220,440,825,1650,2200,99,"Metro"]
[2072,220,220,440,825,1650,2200,99,"Metro"]
[2073,220,220,440,825,1650,2200,99,"Metro"]
[2074,220,220,440,825,1650,2200,99,"Metro"]
[2075,220,220,440,825,1650,2200,99,"Metro"]
[2076,220,220,440,825,1650,2200,99,"Metro"]
[2077,220,220,440,825,1650,2200,99,"Metro"]
[2079,220,220,440,825,1650,2200,99,"Metro"]
[2080,220,220,440,825,1650,2200,99,"Metro"]
[2081,220,220,440,825,1650,2200,99,"Metro"]
[2082,220,220,440,825,1650,2200,99,"Metro"]
[2083,220,220,440,825,1650,2200,99,"Metro"]
[2084,220,220,440,825,1650,2200,99,"Metro"]
[2085,220,220,440,825,1650,2200,99,"Metro"]
[2086,220,220,440,825,1650,2200,99,"Metro"]
[2087,220,220,440,825,1650,2200,99,"Metro"]
[2088,220,220,440,825,1650,2200,99,"Metro"]
[2089,220,220,440,825,1650,2200,99,"Metro"]
[2090,220,220,440,825,1650,2200,99,"Metro"]
[2092,220,220,440,825,1650,2200,99,"Metro"]
[2093,220,220,440,825,1650,2200,99,"Metro"]
[2094,220,220,440,825,1650,2200,99,"Metro"]
[2095,220,220,440,825,1650,2200,99,"Metro"]
[2096,220,220,440,825,1650,2200,99,"Metro"]
[2097,220,220,440,825,1650,2200,99,"Metro"]
[2099,220,220,440,825,1650,2200,99,"Metro"]
[2100,220,220,440,825,1650,2200,99,"Metro"]
[2101,220,220,440,825,1650,2200,99,"Metro"]
[2102,220,220,440,825,1650,2200,99,"Metro"]
[2103,220,220,440,825,1650,2200,99,"Metro"]
[2104,220,220,440,825,1650,2200,99,"Metro"]
[2105,220,220,440,825,1650,2200,99,"Metro"]
[2106,220,220,440,825,1650,2200,99,"Metro"]
[2107,220,220,440,825,1650,2200,99,"Metro"]
[2108,220,220,440,825,1650,2200,99,"Metro"]
[2109,220,220,440,825,1650,2200,99,"Metro"]
[2110,220,220,440,825,1650,2200,99,"Metro"]
[2111,220,220,440,825,1650,2200,99,"Metro"]
[2112,220,220,440,825,1650,2200,99,"Metro"]
[2113,220,220,440,825,1650,2200,99,"Metro"]
[2114,220,220,440,825,1650,2200,99,"Metro"]
[2115,220,220,440,825,1650,2200,99,"Metro"]
[2116,220,220,440,825,1650,2200,99,"Metro"]
[2117,220,220,440,825,1650,2200,99,"Metro"]
[2118,220,220,440,825,1650,2200,99,"Metro"]
[2119,220,220,440,825,1650,2200,99,"Metro"]
[2120,220,220,440,825,1650,2200,99,"Metro"]
[2121,220,220,440,825,1650,2200,99,"Metro"]
[2122,220,220,440,825,1650,2200,99,"Metro"]
[2125,220,220,440,825,1650,2200,99,"Metro"]
[2126,220,220,440,825,1650,2200,99,"Metro"]
[2127,220,220,440,825,1650,2200,99,"Metro"]
[2128,220,220,440,825,1650,2200,99,"Metro"]
[2130,220,220,440,825,1650,2200,99,"Metro"]
[2131,220,220,440,825,1650,2200,99,"Metro"]
[2132,220,220,440,825,1650,2200,99,"Metro"]
[2133,220,220,440,825,1650,2200,99,"Metro"]
[2134,220,220,440,825,1650,2200,99,"Metro"]
[2135,220,220,440,825,1650,2200,99,"Metro"]
[2136,220,220,440,825,1650,2200,99,"Metro"]
[2137,220,220,440,825,1650,2200,99,"Metro"]
[2138,220,220,440,825,1650,2200,99,"Metro"]
[2139,220,220,440,825,1650,2200,99,"Metro"]
[2140,220,220,440,825,1650,2200,99,"Metro"]
[2141,220,220,440,825,1650,2200,99,"Metro"]
[2142,220,220,440,825,1650,2200,99,"Metro"]
[2143,220,220,440,825,1650,2200,99,"Metro"]
[2144,220,220,440,825,1650,2200,99,"Metro"]
[2145,220,220,440,825,1650,2200,99,"Metro"]
[2146,220,220,440,825,1650,2200,99,"Metro"]
[2147,220,220,440,825,1650,2200,99,"Metro"]
[2148,220,220,440,825,1650,2200,99,"Metro"]
[2150,220,220,440,825,1650,2200,99,"Metro"]
[2151,220,220,440,825,1650,2200,99,"Metro"]
[2152,220,220,440,825,1650,2200,99,"Metro"]
[2153,220,220,440,825,1650,2200,99,"Metro"]
[2154,220,220,440,825,1650,2200,99,"Metro"]
[2155,220,220,440,825,1650,2200,99,"Metro"]
[2156,220,220,440,825,1650,2200,99,"Metro"]
[2157,220,220,440,825,1650,2200,99,"Metro"]
[2158,220,220,440,825,1650,2200,99,"Metro"]
[2159,220,220,440,825,1650,2200,99,"Metro"]
[2160,220,220,440,825,1650,2200,99,"Metro"]
[2161,220,220,440,825,1650,2200,99,"Metro"]
[2162,220,220,440,825,1650,2200,99,"Metro"]
[2163,220,220,440,825,1650,2200,99,"Metro"]
[2164,220,220,440,825,1650,2200,99,"Metro"]
[2165,220,220,440,825,1650,2200,99,"Metro"]
[2166,220,220,440,825,1650,2200,99,"Metro"]
[2167,220,220,440,825,1650,2200,99,"Metro"]
[2168,220,220,440,825,1650,2200,99,"Metro"]
[2170,220,220,440,825,1650,2200,99,"Metro"]
[2171,220,220,440,825,1650,2200,99,"Metro"]
[2172,220,220,440,825,1650,2200,99,"Metro"]
[2173,220,220,440,825,1650,2200,99,"Metro"]
[2174,220,220,440,825,1650,2200,99,"Metro"]
[2175,220,220,440,825,1650,2200,99,"Metro"]
[2176,220,220,440,825,1650,2200,99,"Metro"]
[2177,220,220,440,825,1650,2200,99,"Metro"]
[2178,220,220,440,825,1650,2200,99,"Metro"]
[2179,220,220,440,825,1650,2200,99,"Metro"]
[2190,220,220,440,825,1650,2200,99,"Metro"]
[2191,220,220,440,825,1650,2200,99,"Metro"]
[2192,220,220,440,825,1650,2200,99,"Metro"]
[2193,220,220,440,825,1650,2200,99,"Metro"]
[2194,220,220,440,825,1650,2200,99,"Metro"]
[2195,220,220,440,825,1650,2200,99,"Metro"]
[2196,220,220,440,825,1650,2200,99,"Metro"]
[2197,220,220,440,825,1650,2200,99,"Metro"]
[2198,220,220,440,825,1650,2200,99,"Metro"]
[2199,220,220,440,825,1650,2200,99,"Metro"]
[2200,220,220,440,825,1650,2200,99,"Metro"]
[2203,220,220,440,825,1650,2200,99,"Metro"]
[2204,220,220,440,825,1650,2200,99,"Metro"]
[2205,220,220,440,825,1650,2200,99,"Metro"]
{"$rows_left_out":2406}